gradle build failed

try Clean Project. provided dependencies can only be jars. com.android.support:appcompat-v7:aar. dependencies can only ...

gradle build failed

try Clean Project. provided dependencies can only be jars. com.android.support:appcompat-v7:aar. dependencies can only be jars,but you ..., stderr[ FAILURE: Build failed with an exception. * What went wrong: A problem occurred configuring root project 'gradleOut'. > Failed to find ...

相關軟體 Splash 資訊

Splash
隨著 Splash(免費精簡版)觀看高清電影,攝像機剪輯和數字電視(DVB-T)。享受最好的視頻質量和獨特的用戶體驗。 Splash 是緊湊,時尚,用戶友好和令人難以置信的快速(可能是最快的播放器打開,並開始播放相關的高清視頻文件)。享受最好的視頻質量和獨特的用戶體驗!Splash 功能:為 HD 設計和優化!播放所有高清晰度 MPEG- 2 和 AVC / H.264 攝像機剪輯和電影,速度快,... Splash 軟體介紹

gradle build failed 相關參考資料
Gradle Build Failed - 3.6.1 - Stack Overflow

I have not been able to build gradle after installing Android Studio. I have not written any codes for the app and yet the build is failing.

https://stackoverflow.com

Gradle Build failed - Stack Overflow

try Clean Project. provided dependencies can only be jars. com.android.support:appcompat-v7:aar. dependencies can only be jars,but you ...

https://stackoverflow.com

Gradle build failed - Unity Forum

stderr[ FAILURE: Build failed with an exception. * What went wrong: A problem occurred configuring root project 'gradleOut'. > Failed to find ...

https://forum.unity.com

Gradle build failed in Android Studio 1.5.1 - Stack Overflow

Add this to build.gradle file: android ... defaultConfig ... multiDexEnabled true } }. Here you would find an explanation why this error happened: UNEXPECTED ...

https://stackoverflow.com

Gradle BUILD FAILED 如何解決? - IT閱讀 - ITREAD01.COM

Gradle BUILD FAILED 如何解決? android教程 · 發表 2018-10-08. 這篇部落格帶你解決Android Studio 3.0遇到的3種gradle編譯失敗的問題,然後給你一個 ...

https://www.itread01.com

Gradle build fails - Stack Overflow

It's possible, when one subproject doesn't see another, if settings.gradle file is not on the parent directory for both subprojects and the subprojects in it are ...

https://stackoverflow.com

How to fix Android Gradle Failure? - Unity Answers

CommandInvokationFailure: Gradle build failed. /Library/Java/JavaVirtualMachines/jdk-9.jdk/Contents/Home/bin/java -Xmx1024M -classpath ...

https://answers.unity.com